Target
Sialidase-2
Ligand
BDBM5024
Substrate
Meas. Tech.
ChEMBL_623928 (CHEMBL1108053)
Ki
330000±n/a nM
Citation
 Chavas, LMKato, RSuzuki, Nvon Itzstein, MMann, MCThomson, RJDyason, JCMcKimm-Breschkin, JFusi, PTringali, CVenerando, BTettamanti, GMonti, EWakatsuki, S Complexity in influenza virus targeted drug design: interaction with human sialidases. J Med Chem 53:2998-3002 (2010)  
Target
Name:
Sialidase-2
Synonyms:
Cytosolic sialidase NEU2 Sialidase 2 | Sialidase-2
Type:
PROTEIN
Mol. Mass.:
42256.20
Organism:
Homo sapiens (Human)
Description:
ChEMBL_960638
Residue:
380
  
Inhibitor
Name:
BDBM5024
Synonyms:
(-)-(1S,2S,3R,4R)-3-[(1S)-1-(Acetylamino)-2-ethylbutyl]-4-{[amino(imino)methyl]amino}-2-hydroxycyclopentanecarboxylic Acid BCX-1812
Type:
Small organic molecule
Emp. Form.:
C15H28N4O4
Mol. Mass.:
328.4072
SMILES:
[H][C@](NC(C)=O)(C(CC)CC)[C@@H]1[C@H](O)[C@H](C[C@H]1N=C(N)N)C(O)=O
: