Target
Lysosomal acid lipase/cholesteryl ester hydrolase
Ligand
BDBM50318686
Substrate
Meas. Tech.
ChEMBL_633497 (CHEMBL1119694)
IC50
189±n/a nM
Citation
 Rosenbaum, AICosner, CCMariani, CJMaxfield, FRWiest, OHelquist, P Thiadiazole carbamates: potent inhibitors of lysosomal acid lipase and potential Niemann-Pick type C disease therapeutics. J Med Chem 53:5281-9 (2010)  
Target
Name:
Lysosomal acid lipase/cholesteryl ester hydrolase
Synonyms:
LICH_HUMAN | LIPA
Type:
PROTEIN
Mol. Mass.:
45422.01
Organism:
Homo sapiens (Human)
Description:
ChEMBL_633497
Residue:
399
  
Inhibitor
Name:
BDBM50318686
Synonyms:
4-(Azepan-1-yl)-1,2,5-thiadiazol-3-yl morpholine-4-carboxylate | CHEMBL1082839
Type:
Small organic molecule
Emp. Form.:
C13H20N4O3S
Mol. Mass.:
312.388
SMILES:
O=C(Oc1nsnc1N1CCCCCC1)N1CCOCC1
: