Target
Lysosomal acid lipase/cholesteryl ester hydrolase
Ligand
BDBM50318690
Substrate
Meas. Tech.
ChEMBL_633497 (CHEMBL1119694)
IC50
68±n/a nM
Citation
 Rosenbaum, AICosner, CCMariani, CJMaxfield, FRWiest, OHelquist, P Thiadiazole carbamates: potent inhibitors of lysosomal acid lipase and potential Niemann-Pick type C disease therapeutics. J Med Chem 53:5281-9 (2010)  
Target
Name:
Lysosomal acid lipase/cholesteryl ester hydrolase
Synonyms:
LICH_HUMAN | LIPA
Type:
PROTEIN
Mol. Mass.:
45422.01
Organism:
Homo sapiens (Human)
Description:
ChEMBL_633497
Residue:
399
  
Inhibitor
Name:
BDBM50318690
Synonyms:
4-Piperidinyl-1,2,5-thiadiazolyl-3-morpholine carboxylate | CHEMBL1085463
Type:
Small organic molecule
Emp. Form.:
C12H18N4O3S
Mol. Mass.:
298.361
SMILES:
O=C(Oc1nsnc1N1CCCCC1)N1CCOCC1
: