Target
Cruzipain
Ligand
BDBM50366785
Substrate
Meas. Tech.
ChEMBL_635149 (CHEMBL1119971)
IC50
144000±n/a nM
Citation
 Doak, AKWille, HPrusiner, SBShoichet, BK Colloid formation by drugs in simulated intestinal fluid. J Med Chem 53:4259-65 (2010)  
Target
Name:
Cruzipain
Synonyms:
CYSP_TRYCR Cruzaine | Major cysteine proteinase
Type:
Protein
Mol. Mass.:
49831.41
Organism:
Trypanosoma cruzi
Description:
P25779
Residue:
467
  
Inhibitor
Name:
BDBM50366785
Synonyms:
NELFINAVIR
Type:
Small organic molecule
Emp. Form.:
C32H45N3O4S
Mol. Mass.:
567.782
SMILES:
Cc1c(O)cccc1C(=O)N[C@H](CSc1ccccc1)[C@H](O)CN1C[C@H]2CCCC[C@H]2C[C@H]1C(=O)NC(C)(C)C
: