Target
Prolyl endopeptidase FAP
Ligand
BDBM50326372
Substrate
Meas. Tech.
ChEMBL_657413 (CHEMBL1246389)
IC50
54±n/a nM
Citation
 Tsai, TYYeh, TKChen, XHsu, TJao, YCHuang, CHSong, JSHuang, YCChien, CHChiu, JHYen, SCTang, HKChao, YSJiaang, WT Substituted 4-carboxymethylpyroglutamic acid diamides as potent and selective inhibitors of fibroblast activation protein. J Med Chem 53:6572-83 (2010)  
Target
Name:
Prolyl endopeptidase FAP
Synonyms:
170 kDa melanoma membrane-bound gelatinase Fibroblast Activation Protein (FAP) Integral membrane serine protease Seprase
Type:
Enzyme
Mol. Mass.:
87712.48
Organism:
Homo sapiens (Human)
Description:
Q12884
Residue:
760
  
Inhibitor
Name:
BDBM50326372
Synonyms:
(S)-1-((S)-2-amino-5-(1-oxoisoindolin-2-yl)pentanoyl)pyrrolidine-2-carbonitrile | CHEMBL1243372
Type:
Small organic molecule
Emp. Form.:
C18H22N4O2
Mol. Mass.:
326.3929
SMILES:
N[C@@H](CCCN1Cc2ccccc2C1=O)C(=O)N1CCC[C@H]1C#N
: