Target
Prolyl endopeptidase FAP
Ligand
BDBM50326380
Substrate
Meas. Tech.
ChEMBL_657413 (CHEMBL1246389)
IC50
88±n/a nM
Citation
 Tsai, TYYeh, TKChen, XHsu, TJao, YCHuang, CHSong, JSHuang, YCChien, CHChiu, JHYen, SCTang, HKChao, YSJiaang, WT Substituted 4-carboxymethylpyroglutamic acid diamides as potent and selective inhibitors of fibroblast activation protein. J Med Chem 53:6572-83 (2010)  
Target
Name:
Prolyl endopeptidase FAP
Synonyms:
170 kDa melanoma membrane-bound gelatinase Fibroblast Activation Protein (FAP) Integral membrane serine protease Seprase
Type:
Enzyme
Mol. Mass.:
87712.48
Organism:
Homo sapiens (Human)
Description:
Q12884
Residue:
760
  
Inhibitor
Name:
BDBM50326380
Synonyms:
(2S)-1-({(2S,4S)-4-[2-(1,3-Dihydro-2H-isoquinol-2-yl)-2-oxoethyl]-5-oxopyrrolidin-2-yl}carbonyl)pyrrolidine-2-carbonitrile | CHEMBL1242967
Type:
Small organic molecule
Emp. Form.:
C21H24N4O3
Mol. Mass.:
380.4403
SMILES:
O=C(C[C@@H]1C[C@H](NC1=O)C(=O)N1CCC[C@H]1C#N)N1CCc2ccccc2C1
: