Target
Prolyl endopeptidase FAP
Ligand
BDBM50326382
Substrate
Meas. Tech.
ChEMBL_657413 (CHEMBL1246389)
IC50
650±n/a nM
Citation
 Tsai, TYYeh, TKChen, XHsu, TJao, YCHuang, CHSong, JSHuang, YCChien, CHChiu, JHYen, SCTang, HKChao, YSJiaang, WT Substituted 4-carboxymethylpyroglutamic acid diamides as potent and selective inhibitors of fibroblast activation protein. J Med Chem 53:6572-83 (2010)  
Target
Name:
Prolyl endopeptidase FAP
Synonyms:
170 kDa melanoma membrane-bound gelatinase Fibroblast Activation Protein (FAP) Integral membrane serine protease Seprase
Type:
Enzyme
Mol. Mass.:
87712.48
Organism:
Homo sapiens (Human)
Description:
Q12884
Residue:
760
  
Inhibitor
Name:
BDBM50326382
Synonyms:
2S)-1-({(2S,4S)-5-oxo-4-[2-Oxo-[2-(trifluoromethyl)-5,6-dihydroimidazo[1,2-a]pyrazin-7(8H)-yl]ethyl]pyrrolidin-2-yl}carbonyl)-pyrrolidine-2-carbonitrile | CHEMBL1242994
Type:
Small organic molecule
Emp. Form.:
C19H21F3N6O3
Mol. Mass.:
438.4036
SMILES:
FC(F)(F)c1cn2CCN(Cc2n1)C(=O)C[C@@H]1C[C@H](NC1=O)C(=O)N1CCC[C@H]1C#N
: