Target
Prolyl endopeptidase FAP
Ligand
BDBM50326384
Substrate
Meas. Tech.
ChEMBL_657413 (CHEMBL1246389)
IC50
510±n/a nM
Citation
 Tsai, TYYeh, TKChen, XHsu, TJao, YCHuang, CHSong, JSHuang, YCChien, CHChiu, JHYen, SCTang, HKChao, YSJiaang, WT Substituted 4-carboxymethylpyroglutamic acid diamides as potent and selective inhibitors of fibroblast activation protein. J Med Chem 53:6572-83 (2010)  
Target
Name:
Prolyl endopeptidase FAP
Synonyms:
170 kDa melanoma membrane-bound gelatinase Fibroblast Activation Protein (FAP) Integral membrane serine protease Seprase
Type:
Enzyme
Mol. Mass.:
87712.48
Organism:
Homo sapiens (Human)
Description:
Q12884
Residue:
760
  
Inhibitor
Name:
BDBM50326384
Synonyms:
(2S)-1-({(2S,4S)-4-[2-[4-(4-Fluorophenyl)piperazin-1-yl]-2-oxoethyl]-5-oxopyrrolidin-2-yl}carbonyl)pyrrolidine-2-carbonitrile | CHEMBL1243028
Type:
Small organic molecule
Emp. Form.:
C22H26FN5O3
Mol. Mass.:
427.4719
SMILES:
Fc1ccc(cc1)N1CCN(CC1)C(=O)C[C@@H]1C[C@H](NC1=O)C(=O)N1CCC[C@H]1C#N
: