Target
Prolyl endopeptidase FAP
Ligand
BDBM50326391
Substrate
Meas. Tech.
ChEMBL_657413 (CHEMBL1246389)
IC50
63±n/a nM
Citation
 Tsai, TYYeh, TKChen, XHsu, TJao, YCHuang, CHSong, JSHuang, YCChien, CHChiu, JHYen, SCTang, HKChao, YSJiaang, WT Substituted 4-carboxymethylpyroglutamic acid diamides as potent and selective inhibitors of fibroblast activation protein. J Med Chem 53:6572-83 (2010)  
Target
Name:
Prolyl endopeptidase FAP
Synonyms:
170 kDa melanoma membrane-bound gelatinase Fibroblast Activation Protein (FAP) Integral membrane serine protease Seprase
Type:
Enzyme
Mol. Mass.:
87712.48
Organism:
Homo sapiens (Human)
Description:
Q12884
Residue:
760
  
Inhibitor
Name:
BDBM50326391
Synonyms:
(2S,4S)-1-{(2S,4S)-4-[2-(5-Chloro-1,3-dihydroisoindol-2-yl)-2-oxoethyl]-5-oxopyrrolidine-2-carbonyl}-4-fluoropyrrolidine-2-carbonitrile | CHEMBL1243127
Type:
Small organic molecule
Emp. Form.:
C20H20ClFN4O3
Mol. Mass.:
418.849
SMILES:
F[C@H]1C[C@@H](C#N)N(C1)C(=O)[C@@H]1C[C@@H](CC(=O)N2Cc3ccc(Cl)cc3C2)C(=O)N1
: