Target
Dipeptidyl peptidase 8
Ligand
BDBM11695
Substrate
Meas. Tech.
ChEMBL_657414 (CHEMBL1246390)
IC50
14000±n/a nM
Citation
 Tsai, TYYeh, TKChen, XHsu, TJao, YCHuang, CHSong, JSHuang, YCChien, CHChiu, JHYen, SCTang, HKChao, YSJiaang, WT Substituted 4-carboxymethylpyroglutamic acid diamides as potent and selective inhibitors of fibroblast activation protein. J Med Chem 53:6572-83 (2010)  
Target
Name:
Dipeptidyl peptidase 8
Synonyms:
DPP8 DPRP-1 Dipeptidyl peptidase 8 (DPP-8) Dipeptidyl peptidase 8/9 Dipeptidyl peptidase VIII Prolyl dipeptidase DPP8
Type:
Enzyme
Mol. Mass.:
103342.62
Organism:
Homo sapiens (Human)
Description:
Q6V1X1
Residue:
898
  
Inhibitor
Name:
BDBM11695
Synonyms:
(2S)-1-{2-[(3-hydroxyadamantan-1-yl)amino]acetyl}pyrrolidine-2-carbonitrile NVP-LAF237
Type:
Small organic molecule
Emp. Form.:
C17H25N3O2
Mol. Mass.:
303.3993
SMILES:
OC12CC3CC(C1)CC(C3)(C2)NCC(=O)N1CCC[C@H]1C#N
: