Target
Coagulation factor X
Ligand
BDBM50328728
Substrate
Meas. Tech.
ChEMBL_675275 (CHEMBL1273257)
IC50
0.38±n/a nM
Citation
 Pinto, DJSmallheer, JMCheney, DLKnabb, RMWexler, RR Factor Xa inhibitors: next-generation antithrombotic agents. J Med Chem 53:6243-74 (2010)  
Target
Name:
Coagulation factor X
Synonyms:
Activated coagulation factor X (FXa) Coagulation factor X precursor F10 Factor X heavy chain Factor Xa Stuart-Prower factor
Type:
Enzyme
Mol. Mass.:
54726.60
Organism:
Homo sapiens (Human)
Description:
Residue:
488
  
Inhibitor
Name:
BDBM50328728
Synonyms:
(2R,4R)-N1-(4-chlorophenyl)-N2-(3-fluoro-2'-(methylsulfonyl)biphenyl-4-yl)-4-hydroxypyrrolidine-1,2-dicarboxamide 4-Substituted Pyrrolidine Ring, 15 | CHEMBL1269832
Type:
Small organic molecule
Emp. Form.:
C25H23ClFN3O5S
Mol. Mass.:
531.984
SMILES:
CS(=O)(=O)c1ccccc1-c1ccc(NC(=O)[C@H]2C[C@@H](O)CN2C(=O)Nc2ccc(Cl)cc2)c(F)c1
: