Target
Coagulation factor X
Ligand
BDBM50328697
Substrate
Meas. Tech.
ChEMBL_675275 (CHEMBL1273257)
IC50
0.13±n/a nM
Citation
 Pinto, DJSmallheer, JMCheney, DLKnabb, RMWexler, RR Factor Xa inhibitors: next-generation antithrombotic agents. J Med Chem 53:6243-74 (2010)  
Target
Name:
Coagulation factor X
Synonyms:
Activated coagulation factor X (FXa) Coagulation factor X precursor F10 Factor X heavy chain Factor Xa Stuart-Prower factor
Type:
Enzyme
Mol. Mass.:
54726.60
Organism:
Homo sapiens (Human)
Description:
Residue:
488
  
Inhibitor
Name:
BDBM50328697
Synonyms:
(R)-5-guanidino-N-(2-((S)-5-guanidino-1-oxo-1-(thiazol-2-yl)pentan-2-ylamino)-2-oxoethyl)-2-(phenylmethylsulfonamido)pentanamide | CHEMBL414002
Type:
Small organic molecule
Emp. Form.:
C24H36N10O5S2
Mol. Mass.:
608.737
SMILES:
[#7]\[#6](-[#7])=[#7]\[#6]-[#6]-[#6]-[#6@H](-[#7]-[#6](=O)-[#6]-[#7]-[#6](=O)-[#6@@H](-[#6]-[#6]-[#6]\[#7]=[#6](\[#7])-[#7])-[#7]S(=O)(=O)[#6]-c1ccccc1)-[#6](=O)-c1nccs1
: