Target
Sodium/glucose cotransporter 1
Ligand
BDBM50335145
Substrate
Meas. Tech.
ChEMBL_702890 (CHEMBL1655515)
EC50
208.6±n/a nM
Citation
 Chang, CCChao, YSChen, CTChiu, CHChu, KFHsiao, WCHsieh, CJYuan, MCHsieh, TCHuang, CYHung, MSLee, JCLiu, YWSong, JSTsai, CHWang, MHWu, SHYao, CHYeh, TK Discovery of novel N-ß-D-xylosylindole derivatives as sodium-dependent glucose cotransporter 2 (SGLT2) inhibitors for the management of hyperglycemia in diabetes. J Med Chem 54:166-78 (2011)  
Target
Name:
Sodium/glucose cotransporter 1
Synonyms:
High affinity sodium-glucose cotransporter Na(+)/glucose cotransporter 1 SGLT1 Sodium-dependent glucose cotransporter 1 (SGLT1) Sodium/glucose cotransporter 1 (SGLT1) | Solute carrier family 5 member 1
Type:
Protein
Mol. Mass.:
73503.78
Organism:
Homo sapiens (Human)
Description:
P13866
Residue:
664
  
Inhibitor
Name:
BDBM50335145
Synonyms:
4-Chloro-3-(4-cyclopropylbenzyl)-1-(beta-D-xylopyranosyl)-1Hindole | CHEMBL1650501
Type:
Small organic molecule
Emp. Form.:
C23H24ClNO4
Mol. Mass.:
413.894
SMILES:
O[C@@H]1CO[C@H]([C@H](O)[C@H]1O)n1cc(Cc2ccc(cc2)C2CC2)c2c(Cl)cccc12
: