Target
1-deoxy-D-xylulose 5-phosphate reductoisomerase
Ligand
BDBM50335485
Substrate
Meas. Tech.
ChEMBL_702118 (CHEMBL1655348)
IC50
119±n/a nM
Citation
 Deng, LEndo, KKato, MCheng, GYajima, SSong, Y Structures of 1-Deoxy-D-Xylulose-5-Phosphate Reductoisomerase/Lipophilic Phosphonate Complexes. ACS Med Chem Lett 2:165-170 (2011)  
Target
Name:
1-deoxy-D-xylulose 5-phosphate reductoisomerase
Synonyms:
1-Deoxy-D-xylulose 5-phosphate reductoisomerase (DXP) 1-deoxy-D-xylulose 5-phosphate reductoisomerase (DXR) DXP reductoisomerase dxr yaeM
Type:
Protein
Mol. Mass.:
43384.52
Organism:
Escherichia coli
Description:
P45568
Residue:
398
  
Inhibitor
Name:
BDBM50335485
Synonyms:
(R)-1-(3,4-dichlorophenyl)-3-(N-hydroxyacetamido)propylphosphonic acid [(1R)-3-[acetyl(hydroxy)amino]-1-(3,4-dichlorophenyl)propyl]phosphonic acid
Type:
Small organic molecule
Emp. Form.:
C11H14Cl2NO5P
Mol. Mass.:
342.112
SMILES:
CC(=O)N(O)CC[C@H](c1ccc(Cl)c(Cl)c1)P(O)(O)=O
: