Target
Mu-type opioid receptor
Ligand
BDBM50346953
Substrate
Meas. Tech.
ChEMBL_753176 (CHEMBL1799269)
Kd
0.080000±n/a nM
Citation
 Majumdar, SBurgman, MHaselton, NGrinnell, SOcampo, JPasternak, ARPasternak, GW Generation of novel radiolabeled opiates through site-selective iodination. Bioorg Med Chem Lett 21:4001-4 (2011)  
Target
Name:
Mu-type opioid receptor
Synonyms:
M-OR-1 MOR-1 MUOR1 Mu opiate receptor OPRM1 hMOP | mu-type opioid receptor isoform MOR-1
Type:
G Protein-Coupled Receptor (GPCR)
Mol. Mass.:
44789.51
Organism:
Homo sapiens (Human)
Description:
P35372
Residue:
400
  
Inhibitor
Name:
BDBM50346953
Synonyms:
CHEMBL1795713 | CHEMBL1795716
Type:
Small organic molecule
Emp. Form.:
C24H25IN2O4
Mol. Mass.:
532.3708
SMILES:
CN1CC[C@@]23[C@H]4Oc5c2c(C[C@@H]1[C@]3(O)CC[C@H]4NC(=O)c1cccc(I)c1)ccc5O
: