Target
E3 ubiquitin-protein ligase Mdm2
Ligand
BDBM31286
Substrate
Meas. Tech.
ChEMBL_811269 (CHEMBL2015221)
Kd
4800±n/a nM
Citation
 Kemp, MMWeïwer, MKoehler, AN Unbiased binding assays for discovering small-molecule probes and drugs. Bioorg Med Chem 20:1979-89 (2012)  
Target
Name:
E3 ubiquitin-protein ligase Mdm2
Synonyms:
Double minute 2 protein E3 ubiquitin-protein ligase Mdm2 (p53-binding protein Mdm2) Human Double Minute 2 (HDM2) MDM2-MDMX p53-Binding Protein MDM2 | p53-binding protein
Type:
Oncoprotein
Mol. Mass.:
55196.54
Organism:
Homo sapiens (Human)
Description:
Q00987
Residue:
491
  
Inhibitor
Name:
BDBM31286
Synonyms:
benzodiazepinedione, 2
Type:
Small organic molecule
Emp. Form.:
C23H15Cl2IN2O4
Mol. Mass.:
581.187
SMILES:
OC(=O)[C@H](N1[C@H](c2ccc(Cl)cc2)C(=O)Nc2ccc(I)cc2C1=O)c1ccc(Cl)cc1
: