Target
Proteinase-activated receptor 1
Ligand
BDBM50380007
Substrate
Meas. Tech.
ChEMBL_810573 (CHEMBL2015551)
IC50
25±n/a nM
Citation
 Chelliah, MVChackalamannil, SXia, YEagen, KGreenlee, WJAhn, HSAgans-Fantuzzi, JBoykow, GHsieh, YBryant, MChan, TMChintala, M Discovery of nor-seco himbacine analogs as thrombin receptor antagonists. Bioorg Med Chem Lett 22:2544-9 (2012)  
Target
Name:
Proteinase-activated receptor 1
Synonyms:
CF2R F2R PAR1 Proteinase activated receptor 1 TR Thrombin receptor/ Proteinase-activated receptor 1(Par-1)
Type:
Protein
Mol. Mass.:
47450.07
Organism:
Homo sapiens (Human)
Description:
P25116
Residue:
425
  
Inhibitor
Name:
BDBM50380007
Synonyms:
CHEMBL2012492
Type:
Small organic molecule
Emp. Form.:
C25H28ClNO2
Mol. Mass.:
409.948
SMILES:
CC[C@@H]1[C@@H](C)C[C@@H]2[C@@H]([C@@H](C)OC2=O)[C@H]1\C=C\c1ccc(cn1)-c1ccccc1Cl
: