Target
Breast cancer type 1 susceptibility protein
Ligand
BDBM50380351
Substrate
Meas. Tech.
ChEMBL_812733 (CHEMBL2019951)
Ki
540±n/a nM
Citation
 Yuan, ZKumar, EACampbell, SJPalermo, NYKizhake, SMark Glover, JNNatarajan, A Exploiting the P-1 pocket of BRCT domains toward a structure guided inhibitor design. ACS Med Chem Lett 2:764-767 (2011)  
Target
Name:
Breast cancer type 1 susceptibility protein
Synonyms:
BRCA1 RNF53
Type:
PROTEIN
Mol. Mass.:
207672.68
Organism:
Homo sapiens (Human)
Description:
ChEMBL_812733
Residue:
1863
  
Inhibitor
Name:
BDBM50380351
Synonyms:
CHEMBL2017814
Type:
Small organic molecule
Emp. Form.:
C37H47N6O10P
Mol. Mass.:
766.777
SMILES:
CC(C)[C@H](NC(=O)[C@@H]1CCCN1C(=O)[C@H](COP(O)(O)=O)NC(=O)[C@H](Cc1ccc2ccccc2c1)NC(C)=O)C(=O)N[C@@H](Cc1ccccc1)C(N)=O
: