Target
High affinity cAMP-specific 3',5'-cyclic phosphodiesterase 7A
Ligand
BDBM50380656
Substrate
Meas. Tech.
ChEMBL_813181 (CHEMBL2020847)
Ki
3760±n/a nM
Citation
 Ho, GDMichael Seganish, WBercovici, ATulshian, DGreenlee, WJVan Rijn, RHruza, AXiao, LRindgen, DMullins, DGuzzi, MZhang, XBleickardt, CHodgson, R The SAR development of dihydroimidazoisoquinoline derivatives as phosphodiesterase 10A inhibitors for the treatment of schizophrenia. Bioorg Med Chem Lett 22:2585-9 (2012)  
Target
Name:
High affinity cAMP-specific 3',5'-cyclic phosphodiesterase 7A
Synonyms:
3',5'-cyclic phosphodiesterase PDE7A_HUMAN Phosphodiesterase 7 (PDE7) Phosphodiesterase 7A (PDE7A1)
Type:
Enzyme
Mol. Mass.:
55514.96
Organism:
Homo sapiens (Human)
Description:
Q13946
Residue:
482
  
Inhibitor
Name:
BDBM50380656
Synonyms:
CHEMBL2017080
Type:
Small organic molecule
Emp. Form.:
C21H22N2O3
Mol. Mass.:
350.411
SMILES:
CCOc1cccc(c1)-c1ncn2CCc3cc(OC)c(OC)cc3-c12
: