Target
C-C chemokine receptor type 4
Ligand
BDBM50380877
Substrate
Meas. Tech.
ChEMBL_812670 (CHEMBL2019171)
Ki
316.23±n/a nM
Citation
 Procopiou, PAFord, AJGraves, RHHall, DAHodgson, STLacroix, YMNeedham, DSlack, RJ Lead optimisation of the N1 substituent of a novel series of indazole arylsulfonamides as CCR4 antagonists and identification of a candidate for clinical investigation. Bioorg Med Chem Lett 22:2730-3 (2012)  
Target
Name:
C-C chemokine receptor type 4
Synonyms:
C-C CKR-4 C-C chemokine receptor type 4 (CCR4) CCR-4 CCR4_HUMAN CMKBR4 | K5-5
Type:
Enzyme
Mol. Mass.:
41406.41
Organism:
Homo sapiens (Human)
Description:
P51679
Residue:
360
  
Inhibitor
Name:
BDBM50380877
Synonyms:
CHEMBL2018962
Type:
Small organic molecule
Emp. Form.:
C21H19ClN4O4S2
Mol. Mass.:
490.983
SMILES:
CNC(=O)c1cccc(Cn2nc(NS(=O)(=O)c3ccc(Cl)s3)c3c(OC)cccc23)c1
: