Target
NAD-dependent protein deacetylase sirtuin-1
Ligand
BDBM50381099
Substrate
Meas. Tech.
ChEMBL_814181 (CHEMBL2020895)
IC50
40060±n/a nM
Citation
 Alvala, MBhatnagar, SRavi, AJeankumar, VUManjashetty, THYogeeswari, PSriram, D Novel acridinedione derivatives: design, synthesis, SIRT1 enzyme and tumor cell growth inhibition studies. Bioorg Med Chem Lett 22:3256-60 (2012)  
Target
Name:
NAD-dependent protein deacetylase sirtuin-1
Synonyms:
NAD-Dependent Deacetylase Sirtuin-1 NAD-dependent protein deacetylase sirtuin-1 (SIRT1) SIR2-like protein 1 SIRT1 Sirtuin-1 (SIRT1) | hSIR2
Type:
Developmental protein; hydrolase
Mol. Mass.:
81626.66
Organism:
Homo sapiens (Human)
Description:
Residue:
747
  
Inhibitor
Name:
BDBM50381099
Synonyms:
CHEMBL2017559
Type:
Small organic molecule
Emp. Form.:
C36H38N2O3
Mol. Mass.:
546.6985
SMILES:
CC1(C)CC(=O)C2=C(C1)N(Nc1ccccc1)C1=C(C2c2cccc(OCc3ccccc3)c2)C(=O)CC(C)(C)C1
: