Target
Muscarinic acetylcholine receptor M1
Ligand
BDBM43822
Substrate
Meas. Tech.
ChEMBL_815533 (CHEMBL2025062)
EC50
2600±n/a nM
Citation
 Melancon, BJGogliotti, RDTarr, JCSaleh, SAChauder, BALebois, EPCho, HPUtley, TJSheffler, DJBridges, TMMorrison, RDDaniels, JSNiswender, CMConn, PJLindsley, CWWood, MR Continued optimization of the MLPCN probe ML071 into highly potent agonists of the hM1 muscarinic acetylcholine receptor. Bioorg Med Chem Lett 22:3467-72 (2012)  
Target
Name:
Muscarinic acetylcholine receptor M1
Synonyms:
ACM1_HUMAN Cholinergic receptor, muscarinic 1 | Cholinergic, muscarinic M1
Type:
Protein
Mol. Mass.:
51442.54
Organism:
Homo sapiens (Human)
Description:
P11229
Residue:
460
  
Inhibitor
Name:
BDBM43822
Synonyms:
4-[2-(o-toluoylamino)ethylamino]piperidine-1-carboxylic acid ethyl ester;hydrochloride CHEMBL1624037 cid_25010775 ethyl 4-[2-[(2-methylphenyl)carbonylamino]ethylamino]piperidine-1-carboxylate;hydrochloride
Type:
Small organic molecule
Emp. Form.:
C18H27N3O3
Mol. Mass.:
333.4253
SMILES:
CCOC(=O)N1CCC(CC1)NCCNC(=O)c1ccccc1C
: