Target
Relaxin receptor 1
Ligand
BDBM50382993
Substrate
Meas. Tech.
ChEMBL_818426 (CHEMBL2034746)
Ki
>10000±n/a nM
Citation
 Shabanpoor, FAkhter Hossain, MRyan, PJBelgi, ALayfield, SKocan, MZhang, SSamuel, CSGundlach, ALBathgate, RASeparovic, FWade, JD Minimization of human relaxin-3 leading to high-affinity analogues with increased selectivity for relaxin-family peptide 3 receptor (RXFP3) over RXFP1. J Med Chem 55:1671-81 (2012)  
Target
Name:
Relaxin receptor 1
Synonyms:
LGR7 RXFP1 Relaxin family peptide receptor 1
Type:
PROTEIN
Mol. Mass.:
86990.83
Organism:
Homo sapiens (Human)
Description:
ChEMBL_818426
Residue:
757
  
Inhibitor
Name:
BDBM50382993
Synonyms:
CHEMBL2030702
Type:
Small organic molecule
Emp. Form.:
C154H239N45O44S4
Mol. Mass.:
3553.081
SMILES:
CC[C@H](C)[C@@H]1NC(=O)[C@H](CCC(O)=O)NC(=O)[C@H](CO)NC(=O)[C@H](CCCCN)NC(=O)[C@H](CO)NC(=O)[C@H](C)NC(=O)CNC(=O)[C@H](Cc2c[nH]c3ccccc23)NC(=O)[C@H](CCCCN)NC(=O)[C@@H](N)CSSC[C@H](N)C(=O)NCC(=O)N[C@@H](CCCN=C(N)N)C(=O)N[C@@H](CCC(O)=O)C(=O)N[C@@H](Cc2ccccc2)C(=O)N[C@@H]([C@@H](C)CC)C(=O)N[C@@H](CCCN=C(N)N)C(=O)N[C@@H](C)C(=O)N[C@@H](C(C)C)C(=O)N[C@@H]([C@@H](C)CC)C(=O)N[C@@H](Cc2ccccc2)C(=O)N[C@@H]([C@@H](C)O)C(=O)N[C@@H](CSSC[C@H](NC(=O)[C@H](CC(C)C)NC(=O)[C@H](CO)NC(=O)[C@H](CO)NC1=O)C(O)=O)C(=O)NCC(=O)NCC(=O)N[C@@H](CO)C(=O)N[C@@H](CCCN=C(N)N)C(=O)N[C@@H](Cc1c[nH]c2ccccc12)C(O)=O
: