Target
Melanin-concentrating hormone receptor 1
Ligand
BDBM50383522
Substrate
Meas. Tech.
ChEMBL_818575 (CHEMBL2032862)
IC50
0.8±n/a nM
Citation
 Mihalic, JTFan, PChen, XChen, XFu, YMotani, ALiang, LLindstrom, MTang, LChen, JLJaen, JDai, KLi, L Discovery of a novel melanin concentrating hormone receptor 1 (MCHR1) antagonist with reduced hERG inhibition. Bioorg Med Chem Lett 22:3781-5 (2012)  
Target
Name:
Melanin-concentrating hormone receptor 1
Synonyms:
G-protein coupled receptor 24 MCH receptor 1 MCH-R1 MCHR MCHR1_RAT Melanin Concentrating Hormone 1 Melanin-concentrating hormone receptor 1 Slc1 | Somatostatin receptor-like protein
Type:
Enzyme Catalytic Domain
Mol. Mass.:
39075.64
Organism:
RAT
Description:
Melanin Concentrating Hormone 1 GPR24 RAT::P97639
Residue:
353
  
Inhibitor
Name:
BDBM50383522
Synonyms:
CHEMBL2032049
Type:
Small organic molecule
Emp. Form.:
C26H33F3N2O2
Mol. Mass.:
462.5476
SMILES:
C[C@@H]1[C@H]2CN(CCC3(CCCCC3)C(O)=O)CC[C@@H]2Cc2[nH]c3ccc(cc3c12)C(F)(F)F
: