Target
Integrin alpha-V/beta-3
Ligand
BDBM50383862
Substrate
Meas. Tech.
ChEMBL_819484 (CHEMBL2033289)
IC50
23±n/a nM
Citation
 Delouvrié, BAl-Kadhimi, KArnould, JCBarry, STCross, DADidelot, MGavine, PRGermain, HHarris, CSHughes, AMJude, DAKendrew, JLambert-van der Brempt, CLohmann, JJMénard, MMortlock, AAPass, MRooney, CVautier, MVincent, JLWarin, N Structure-activity relationship of a series of non peptidic RGD integrin antagonists targetinga5ß1: part 1. Bioorg Med Chem Lett 22:4111-6 (2012)  
Target
Name:
Integrin alpha-V/beta-3
Synonyms:
ITGAV/ITGB3 | Integrin beta-3/Vitronectin receptor alpha
Type:
Enzyme
Mol. Mass.:
Description:
Components:
This complex has 2 components.
Component 1
Name:
Integrin alpha-V
Synonyms:
ITAV_HUMAN Integrin alpha-V/alpha-5 VNRA Vitronectin receptor | Vitronectin receptor subunit alpha
Type:
PROTEIN
Mol. Mass.:
116024.92
Organism:
Homo sapiens (Human)
Description:
ChEMBL_582336
Residue:
1048
  
Component 2
Name:
Integrin beta-3
Synonyms:
CD_antigen=CD61 GPIIIa ITGB3 Platelet membrane glycoprotein IIIa
Type:
Protein
Mol. Mass.:
87038.91
Organism:
Homo sapiens (Human)
Description:
P05106
Residue:
788
  
Inhibitor
Name:
BDBM50383862
Synonyms:
CHEMBL2031168
Type:
Small organic molecule
Emp. Form.:
C26H26Cl2N4O4
Mol. Mass.:
529.415
SMILES:
CN1CCNc2nc(CCOc3ccc(C[C@H](NC(=O)c4c(Cl)cccc4Cl)C(O)=O)cc3)ccc12
: