Target
Integrin alpha-5/beta-1
Ligand
BDBM50383863
Substrate
Meas. Tech.
ChEMBL_819478 (CHEMBL2033283)
IC50
3±n/a nM
Citation
 Delouvrié, BAl-Kadhimi, KArnould, JCBarry, STCross, DADidelot, MGavine, PRGermain, HHarris, CSHughes, AMJude, DAKendrew, JLambert-van der Brempt, CLohmann, JJMénard, MMortlock, AAPass, MRooney, CVautier, MVincent, JLWarin, N Structure-activity relationship of a series of non peptidic RGD integrin antagonists targetinga5ß1: part 1. Bioorg Med Chem Lett 22:4111-6 (2012)  
Target
Name:
Integrin alpha-5/beta-1
Synonyms:
Fibronectin receptor alpha/beta ITGA5/ITGB1
Type:
Enzyme
Mol. Mass.:
Description:
Components:
This complex has 2 components.
Component 1
Name:
Integrin alpha-5
Synonyms:
CD49 antigen-like family member E FNRA Fibronectin receptor subunit alpha ITGA5 Integrin alpha-F | VLA-5
Type:
Single-pass type I membrane protein
Mol. Mass.:
114523.00
Organism:
Homo sapiens (Human)
Description:
Residue:
1049
  
Component 2
Name:
Integrin beta-1
Synonyms:
CD_antigen=CD29 Fibronectin receptor beta GPIIA ITGB1 MDF2 | MSK12
Type:
Enzyme
Mol. Mass.:
88400.38
Organism:
Homo sapiens (Human)
Description:
P05556
Residue:
798
  
Inhibitor
Name:
BDBM50383863
Synonyms:
CHEMBL2031162
Type:
Small organic molecule
Emp. Form.:
C26H24Cl2N4O4
Mol. Mass.:
527.399
SMILES:
OC(=O)[C@H](Cc1ccc(NC(=O)Cc2ccc3CCCNc3n2)cc1)NC(=O)c1c(Cl)cccc1Cl
: