Target
Glycogen phosphorylase, muscle form
Ligand
BDBM50386290
Substrate
Meas. Tech.
ChEMBL_824549 (CHEMBL2045432)
Ki
1940±n/a nM
Citation
 Kantsadi, ALManta, SPsarra, AMDimopoulou, AKiritsis, CParmenopoulou, VSkamnaki, VTZoumpoulakis, PZographos, SELeonidas, DDKomiotis, D The binding of C5-alkynyl and alkylfurano[2,3-d]pyrimidine glucopyranonucleosides to glycogen phosphorylase b: synthesis, biochemical and biological assessment. Eur J Med Chem 54:740-9 (2012)  
Target
Name:
Glycogen phosphorylase, muscle form
Synonyms:
Glycogen phosphorylase, muscle form Myophosphorylase PYGM_HUMAN
Type:
PROTEIN
Mol. Mass.:
97097.45
Organism:
Homo sapiens (Human)
Description:
ChEMBL_1449751
Residue:
842
  
Inhibitor
Name:
BDBM50386290
Synonyms:
CHEMBL2040853
Type:
Small organic molecule
Emp. Form.:
C10H13IN2O7
Mol. Mass.:
400.1239
SMILES:
OC[C@H]1O[C@H]([C@H](O)[C@@H](O)[C@@H]1O)n1cc(I)c(=O)[nH]c1=O
: