Target
Proteinase-activated receptor 1
Ligand
BDBM50386395
Substrate
Meas. Tech.
ChEMBL_826811 (CHEMBL2051432)
IC50
710±n/a nM
Citation
 Dockendorff, CAisiku, OVerplank, LDilks, JRSmith, DAGunnink, SFDowal, LNegri, JPalmer, MMacpherson, LSchreiber, SLFlaumenhaft, R Discovery of 1,3-Diaminobenzenes as Selective Inhibitors of Platelet Activation at the PAR1 Receptor. ACS Med Chem Lett 3:232-237 (2012)  
Target
Name:
Proteinase-activated receptor 1
Synonyms:
CF2R F2R PAR1 Proteinase activated receptor 1 TR Thrombin receptor/ Proteinase-activated receptor 1(Par-1)
Type:
Protein
Mol. Mass.:
47450.07
Organism:
Homo sapiens (Human)
Description:
P25116
Residue:
425
  
Inhibitor
Name:
BDBM50386395
Synonyms:
CHEMBL2048425
Type:
Small organic molecule
Emp. Form.:
C18H17F3N2O3
Mol. Mass.:
366.3344
SMILES:
CCCC(=O)Nc1cccc(NC(=O)c2ccccc2OC(F)(F)F)c1
: