Target
Carbonic anhydrase 2
Ligand
BDBM10864
Substrate
Meas. Tech.
ChEMBL_826238 (CHEMBL2049249)
Ki
40±n/a nM
Citation
 Hewitson, KSVullo, DScozzafava, AMastrolorenzo, ASupuran, CT Molecular cloning, characterization, and inhibition studies of aß-carbonic anhydrase from Malassezia globosa, a potential antidandruff target. J Med Chem 55:3513-20 (2012)  
Target
Name:
Carbonic anhydrase 2
Synonyms:
CA-II CAC Carbonate dehydratase II Carbonic anhydrase 2 (CA-II) Carbonic anhydrase C Carbonic anhydrase II (CA-II) Carbonic anhydrase II (hCA II) | Carbonic anhydrase isoenzyme II (hCA II)
Type:
Enzyme
Mol. Mass.:
29250.71
Organism:
Homo sapiens (Human)
Description:
P00918
Residue:
260
  
Inhibitor
Name:
BDBM10864
Synonyms:
4-Amino-3-bromobenzenesulfonamide CHEMBL6724 halogenosulfanilamide deriv. 5d
Type:
Small organic molecule
Emp. Form.:
C6H7BrN2O2S
Mol. Mass.:
251.101
SMILES:
Nc1ccc(cc1Br)S(N)(=O)=O
: