Target
Nischarin
Ligand
BDBM50387827
Substrate
Meas. Tech.
ChEMBL_828755 (CHEMBL2060405)
Ki
0.218776±n/a nM
Citation
 Schann, SGreney, HGasparik, VDontenwill, MRascente, CLacroix, GMonassier, LBruban, VFeldman, JEhrhardt, JDBousquet, P Methylation of imidazoline related compounds leads to loss ofa2-adrenoceptor affinity. Synthesis and biological evaluation of selective I1 imidazoline receptor ligands. Bioorg Med Chem 20:4710-5 (2012)  
Target
Name:
Nischarin
Synonyms:
Imidazoline I1 Nisch | Nischarin
Type:
Enzyme Catalytic Domain
Mol. Mass.:
166460.59
Organism:
RAT
Description:
Q4G017
Residue:
1502
  
Inhibitor
Name:
BDBM50387827
Synonyms:
CHEMBL2058635
Type:
Small organic molecule
Emp. Form.:
C11H12ClIN2
Mol. Mass.:
334.584
SMILES:
CC1CCC(N1)=Nc1ccc(I)cc1Cl
: