Target
DNA gyrase subunit B
Ligand
BDBM50388100
Substrate
Meas. Tech.
ChEMBL_830517 (CHEMBL2061329)
IC50
4±n/a nM
Citation
 Manchester, JIDussault, DDRose, JABoriack-Sjodin, PAUria-Nickelsen, MIoannidis, GBist, SFleming, PHull, KG Discovery of a novel azaindole class of antibacterial agents targeting the ATPase domains of DNA gyrase and Topoisomerase IV. Bioorg Med Chem Lett 22:5150-6 (2012)  
Target
Name:
DNA gyrase subunit B
Synonyms:
DNA gyrase DNA gyrase subunit B (gyrB) gyrB
Type:
Enzyme Subunit
Mol. Mass.:
72530.91
Organism:
Staphylococcus aureus
Description:
Residue:
644
  
Inhibitor
Name:
BDBM50388100
Synonyms:
CHEMBL2059379
Type:
Small organic molecule
Emp. Form.:
C22H17F3N8O4
Mol. Mass.:
514.4168
SMILES:
CCNC(=O)c1cc2c(c(cnc2[nH]1)-c1cnc(OC)c(c1)-c1n[nH]c(=O)o1)-n1ccc(n1)C(F)(F)F
: