Target
Tyrosyl-DNA phosphodiesterase 1
Ligand
BDBM50388602
Substrate
Meas. Tech.
ChEMBL_830581 (CHEMBL2061436)
IC50
30000±n/a nM
Citation
 Nguyen, TXMorrell, AConda-Sheridan, MMarchand, CAgama, KBermingham, ABermingam, AStephen, AGChergui, ANaumova, AFisher, RO'Keefe, BRPommier, YCushman, M Synthesis and biological evaluation of the first dual tyrosyl-DNA phosphodiesterase I (Tdp1)-topoisomerase I (Top1) inhibitors. J Med Chem 55:4457-78 (2012)  
Target
Name:
Tyrosyl-DNA phosphodiesterase 1
Synonyms:
TDP1 Tyrosyl-DNA phosphodiesterase 1 | Tyrosyl-DNA phosphodiesterase 1 (TDP1)
Type:
Enzyme
Mol. Mass.:
68430.66
Organism:
Homo sapiens (Human)
Description:
Q9NUW8
Residue:
608
  
Inhibitor
Name:
BDBM50388602
Synonyms:
FURAMIDINE
Type:
Small organic molecule
Emp. Form.:
C18H16N4O
Mol. Mass.:
304.3458
SMILES:
NC(=N)c1ccc(cc1)-c1ccc(o1)-c1ccc(cc1)C(N)=N
: