Target
D(2) dopamine receptor
Ligand
BDBM50388674
Substrate
Meas. Tech.
ChEMBL_829291 (CHEMBL2060138)
Ki
5.5±n/a nM
Citation
 Sams, AGLarsen, KMikkelsen, GKHentzer, MChristoffersen, CTJensen, KGFrederiksen, KBang-Andersen, B Hit-to-lead investigation of a series of novel combined dopamine D2 and muscarinic M1 receptor ligands with putative antipsychotic and pro-cognitive potential. Bioorg Med Chem Lett 22:5134-40 (2012)  
Target
Name:
D(2) dopamine receptor
Synonyms:
D(2) dopamine receptor DOPAMINE D2 Long DRD2 Dopamine D2 receptor Dopamine D2 receptor (D2R) Dopamine2-like | d2
Type:
Cell-surface receptors
Mol. Mass.:
50647.10
Organism:
Homo sapiens (Human)
Description:
P14416
Residue:
443
  
Inhibitor
Name:
BDBM50388674
Synonyms:
OXIPEROMIDE
Type:
Small organic molecule
Emp. Form.:
C20H23N3O2
Mol. Mass.:
337.4155
SMILES:
O=c1[nH]c2ccccc2n1C1CCN(CCOc2ccccc2)CC1
: