Target
Serine/threonine-protein kinase PAK 4
Ligand
BDBM50389123
Substrate
Meas. Tech.
ChEMBL_832969 (CHEMBL2066924)
EC50
1±n/a nM
Citation
 Guo, CMcAlpine, IZhang, JKnighton, DDKephart, SJohnson, MCLi, HBouzida, DYang, ADong, LMarakovits, JTikhe, JRichardson, PGuo, LCKania, REdwards, MPKraynov, EChristensen, JPiraino, JLee, JDagostino, EDel-Carmen, CDeng, YLSmeal, TMurray, BW Discovery of pyrroloaminopyrazoles as novel PAK inhibitors. J Med Chem 55:4728-39 (2012)  
Target
Name:
Serine/threonine-protein kinase PAK 4
Synonyms:
KIAA1142 PAK4_HUMAN | p21-Activated kinase 4 (PAK4)
Type:
Protein
Mol. Mass.:
64098.01
Organism:
Homo sapiens (Human)
Description:
O96013
Residue:
591
  
Inhibitor
Name:
BDBM50389123
Synonyms:
CHEMBL2064631
Type:
Small organic molecule
Emp. Form.:
C23H30F3N5O3
Mol. Mass.:
481.5112
SMILES:
CN(C)C[C@@H](OC(=O)N1Cc2c(NC(=O)C(C)(C)C(F)(F)F)[nH]nc2C1(C)C)c1ccccc1
: