Target
Sodium/glucose cotransporter 1
Ligand
BDBM50389347
Substrate
Meas. Tech.
ChEMBL_831838 (CHEMBL2065402)
EC50
4962±n/a nM
Citation
 Yao, CHSong, JSChen, CTYeh, TKHsieh, TCWu, SHHuang, CYHuang, YLWang, MHLiu, YWTsai, CHKumar, CRLee, JC Synthesis and biological evaluation of novel C-indolylxylosides as sodium-dependent glucose co-transporter 2 inhibitors. Eur J Med Chem 55:32-8 (2012)  
Target
Name:
Sodium/glucose cotransporter 1
Synonyms:
High affinity sodium-glucose cotransporter Na(+)/glucose cotransporter 1 SGLT1 Sodium-dependent glucose cotransporter 1 (SGLT1) Sodium/glucose cotransporter 1 (SGLT1) | Solute carrier family 5 member 1
Type:
Protein
Mol. Mass.:
73503.78
Organism:
Homo sapiens (Human)
Description:
P13866
Residue:
664
  
Inhibitor
Name:
BDBM50389347
Synonyms:
CHEMBL2064096
Type:
Small organic molecule
Emp. Form.:
C24H23NO4
Mol. Mass.:
389.4437
SMILES:
O[C@@H]1CO[C@H]([C@H](O)[C@H]1O)c1cn(Cc2ccc3ccccc3c2)c2ccccc12
: