Target
Sodium/glucose cotransporter 1
Ligand
BDBM50389351
Substrate
Meas. Tech.
ChEMBL_831838 (CHEMBL2065402)
EC50
55±n/a nM
Citation
 Yao, CHSong, JSChen, CTYeh, TKHsieh, TCWu, SHHuang, CYHuang, YLWang, MHLiu, YWTsai, CHKumar, CRLee, JC Synthesis and biological evaluation of novel C-indolylxylosides as sodium-dependent glucose co-transporter 2 inhibitors. Eur J Med Chem 55:32-8 (2012)  
Target
Name:
Sodium/glucose cotransporter 1
Synonyms:
High affinity sodium-glucose cotransporter Na(+)/glucose cotransporter 1 SGLT1 Sodium-dependent glucose cotransporter 1 (SGLT1) Sodium/glucose cotransporter 1 (SGLT1) | Solute carrier family 5 member 1
Type:
Protein
Mol. Mass.:
73503.78
Organism:
Homo sapiens (Human)
Description:
P13866
Residue:
664
  
Inhibitor
Name:
BDBM50389351
Synonyms:
CHEMBL2064101
Type:
Small organic molecule
Emp. Form.:
C24H27NO4
Mol. Mass.:
393.4755
SMILES:
Cc1cccc2c(cn(Cc3ccc(cc3)C3CC3)c12)[C@@H]1OC[C@@H](O)[C@H](O)[C@H]1O
: