Target
Prostaglandin G/H synthase 2
Ligand
BDBM50240612
Substrate
Meas. Tech.
ChEMBL_831996 (CHEMBL2065254)
IC50
64±n/a nM
Citation
 Liang, JLPark, SEKwon, YJahng, Y Synthesis of benzo-annulated tryptanthrins and their biological properties. Bioorg Med Chem 20:4962-7 (2012)  
Target
Name:
Prostaglandin G/H synthase 2
Synonyms:
COX2 Cyclooxygenase 2 (COX-2) Cyclooxygenase-2 (COX-2 AA) Cyclooxygenase-2 (COX-2) PGH2_HUMAN PHS II Prostaglandin E synthase/G/H synthase 2 Prostaglandin-endoperoxide synthase 2
Type:
Enzyme
Mol. Mass.:
69003.89
Organism:
Homo sapiens (Human)
Description:
Recombinant Cox-2 provided by Cayman (Cayman Chemical Co.,Ann Arbor, MI).
Residue:
604
  
Inhibitor
Name:
BDBM50240612
Synonyms:
CHEMBL306946 Indolo[2,1-b]quinazoline-6,12-dione TRYPTANTHRIN | US10669273, Compound 5a
Type:
Small organic molecule
Emp. Form.:
C15H8N2O2
Mol. Mass.:
248.2362
SMILES:
O=C1c2ccccc2-n2c1nc1ccccc1c2=O
: