Target
Adenosine receptor A2a
Ligand
BDBM50389796
Substrate
Meas. Tech.
ChEMBL_834570 (CHEMBL2072278)
Ki
550±n/a nM
Citation
 Tosh, DKPhan, KGao, ZGGakh, AAXu, FDeflorian, FAbagyan, RStevens, RCJacobson, KAKatritch, V Optimization of adenosine 5'-carboxamide derivatives as adenosine receptor agonists using structure-based ligand design and fragment screening. J Med Chem 55:4297-308 (2012)  
Target
Name:
Adenosine receptor A2a
Synonyms:
AA2AR_RAT Adenosine A2 receptor Adenosine Receptors A2a (A2a) Adenosine receptors A2a Rat striatal adenosine A2a receptor
Type:
G Protein-Coupled Receptor (GPCR)
Mol. Mass.:
45015.65
Organism:
Rattus norvegicus (rat)
Description:
Rat A2A receptors expressed in CHO cells.
Residue:
410
  
Inhibitor
Name:
BDBM50389796
Synonyms:
CHEMBL1235128
Type:
Small organic molecule
Emp. Form.:
C13H18N6O4
Mol. Mass.:
322.3198
SMILES:
CCCNC(=O)[C@H]1O[C@H]([C@H](O)[C@@H]1O)n1cnc2c(N)ncnc12
: