Target
Serine/threonine-protein kinase Chk1
Ligand
BDBM50389815
Substrate
Meas. Tech.
ChEMBL_834717 (CHEMBL2072693)
EC50
10±n/a nM
Citation
 Oza, VAshwell, SAlmeida, LBrassil, PBreed, JDeng, CGero, TGrondine, MHorn, CIoannidis, SLiu, DLyne, PNewcombe, NPass, MRead, JReady, SRowsell, SSu, MToader, DVasbinder, MYu, DYu, YXue, YZabludoff, SJanetka, J Discovery of checkpoint kinase inhibitor (S)-5-(3-fluorophenyl)-N-(piperidin-3-yl)-3-ureidothiophene-2-carboxamide (AZD7762) by structure-based design and optimization of thiophenecarboxamide ureas. J Med Chem 55:5130-42 (2012)  
Target
Name:
Serine/threonine-protein kinase Chk1
Synonyms:
CHEK1 CHK1 checkpoint homolog Checkpoint kinase-1 (CHK1)
Type:
Enzyme Catalytic Domain
Mol. Mass.:
54443.02
Organism:
Homo sapiens (Human)
Description:
gi_166295192
Residue:
476
  
Inhibitor
Name:
BDBM50389815
Synonyms:
CHEMBL2070704
Type:
Small organic molecule
Emp. Form.:
C17H19ClN4O2S
Mol. Mass.:
378.876
SMILES:
NC(=O)Nc1cc(sc1C(=O)N[C@H]1CCCNC1)-c1cccc(Cl)c1
: