Target
Lysine-specific demethylase 6A
Ligand
BDBM26113
Substrate
Meas. Tech.
ChEMBL_835850 (CHEMBL2071961)
IC50
177000±n/a nM
Citation
 Leurs, UClausen, RPKristensen, JLLohse, B Inhibitor scaffold for the histone lysine demethylase KDM4C (JMJD2C). Bioorg Med Chem Lett 22:5811-3 (2012)  
Target
Name:
Lysine-specific demethylase 6A
Synonyms:
Histone demethylase UTX KDM6A_HUMAN Lysine-specific demethylase 6A (KDM6A(UTX)) UTX Ubiquitously-transcribed X chromosome tetratricopeptide repeat protein
Type:
Protein
Mol. Mass.:
154198.48
Organism:
Homo sapiens (Human)
Description:
O15550
Residue:
1401
  
Inhibitor
Name:
BDBM26113
Synonyms:
2,4 PDCA pyridine carboxylate, 6a | pyridine-2,4-dicarboxylic acid
Type:
Small organic molecule
Emp. Form.:
C7H5NO4
Mol. Mass.:
167.1189
SMILES:
OC(=O)c1ccnc(c1)C(O)=O
: