Target
ATP-binding cassette sub-family C member 2
Ligand
BDBM50390984
Substrate
Meas. Tech.
ChEMBL_839289 (CHEMBL2077960)
Ki
65500±n/a nM
Citation
 Akhteruzzaman, SKato, YHisaka, ASugiyama, Y Primary active transport of peptidic endothelin antagonists by rat hepatic canalicular membrane. J Pharmacol Exp Ther 288:575-81 (1999) Target
Name:
ATP-binding cassette sub-family C member 2
Synonyms:
ATP-binding cassette sub-family C member 2 Canalicular multidrug resistance protein Cmoat MRP2_RAT Multidrug resistance-associated protein 2
Type:
PROTEIN
Mol. Mass.:
173415.22
Organism:
Rattus norvegicus
Description:
ChEMBL_1455464
Residue:
1541
  
Inhibitor
Name:
BDBM50390984
Synonyms:
CHEMBL2074702
Type:
Small organic molecule
Emp. Form.:
C32H38N6O7S
Mol. Mass.:
650.745
SMILES:
CC(C)C[C@@H]1NC(=O)[C@H](NC(=O)[C@@H]2CCCN2C(=O)[C@@H](CC(O)=O)NC(=O)[C@@H](Cc2c[nH]c3ccccc23)NC1=O)c1cccs1
: