Target
Monocarboxylate transporter 2
Ligand
BDBM50270275
Substrate
Meas. Tech.
ChEMBL_838262 (CHEMBL2076210)
Ki
1200000±n/a nM
Citation
 Bröer, SBröer, ASchneider, HPStegen, CHalestrap, APDeitmer, JW Characterization of the high-affinity monocarboxylate transporter MCT2 in Xenopus laevis oocytes. Biochem J 341:529-35 (1999)  
Target
Name:
Monocarboxylate transporter 2
Synonyms:
MOT2_RAT RCG59598, isoform CRA_b Slc16a7 protein
Type:
PROTEIN
Mol. Mass.:
53065.35
Organism:
Rattus norvegicus
Description:
ChEMBL_838262
Residue:
489
  
Inhibitor
Name:
BDBM50270275
Synonyms:
3-OH butyrate 3-hydroxybutanoate beta-hydroxy-n-butyrate | beta-hydroxybutanoate
Type:
Small organic molecule
Emp. Form.:
C4H7O3
Mol. Mass.:
103.0971
SMILES:
CC(O)CC([O-])=O
: