Target
Cytochrome P450 26A1
Ligand
BDBM50342140
Substrate
Meas. Tech.
ChEMBL_848138 (CHEMBL2148657)
IC50
10±n/a nM
Citation
 Gomaa, MSLim, ASLau, SCWatts, AMIllingworth, NABridgens, CEVeal, GJRedfern, CPBrancale, AArmstrong, JLSimons, C Synthesis and CYP26A1 inhibitory activity of novel methyl 3-[4-(arylamino)phenyl]-3-(azole)-2,2-dimethylpropanoates. Bioorg Med Chem 20:6080-8 (2012)  
Target
Name:
Cytochrome P450 26A1
Synonyms:
CP26A_HUMAN CYP26A1 Cytochrome P450 26A1 P450RAI1 | Retinoic acid 4-hydroxylase
Type:
Enzyme
Mol. Mass.:
56216.16
Organism:
Homo sapiens (Human)
Description:
O43174
Residue:
497
  
Inhibitor
Name:
BDBM50342140
Synonyms:
3-Imidazol-1-yl-2,2-dimethyl-3-(4-phenylaminophenyl)-propionicAcid Methyl Ester | CHEMBL1766000
Type:
Small organic molecule
Emp. Form.:
C21H23N3O2
Mol. Mass.:
349.4262
SMILES:
COC(=O)C(C)(C)C(c1ccc(Nc2ccccc2)cc1)n1ccnc1
: