Target
Hydroxycarboxylic acid receptor 1
Ligand
BDBM50391829
Substrate
Meas. Tech.
ChEMBL_850283 (CHEMBL2150703)
EC50
>1000000±n/a nM
Citation
 Dvorak, CALiu, CShelton, JKuei, CSutton, SWLovenberg, TWCarruthers, NI Identification of Hydroxybenzoic Acids as Selective Lactate Receptor (GPR81) Agonists with Antilipolytic Effects. ACS Med Chem Lett 3:637-639 (2012)  
Target
Name:
Hydroxycarboxylic acid receptor 1
Synonyms:
G-protein coupled receptor 104 GPR81 HCAR1 | HCAR1_HUMAN
Type:
PROTEIN
Mol. Mass.:
39313.04
Organism:
Homo sapiens (Human)
Description:
ChEMBL_850283
Residue:
346
  
Inhibitor
Name:
BDBM50391829
Synonyms:
CHEMBL2146993
Type:
Small organic molecule
Emp. Form.:
C7H6N4O2
Mol. Mass.:
178.1481
SMILES:
Oc1cc(O)cc(c1)-c1nnn[nH]1
: