Target
E3 ubiquitin-protein ligase Mdm2
Ligand
BDBM50392242
Substrate
Meas. Tech.
ChEMBL_850546 (CHEMBL2157768)
Kd
0.45±n/a nM
Citation
 Zhan, CZhao, LWei, XWu, XChen, XYuan, WLu, WYPazgier, MLu, W An ultrahigh affinity d-peptide antagonist Of MDM2. J Med Chem 55:6237-41 (2012)  
Target
Name:
E3 ubiquitin-protein ligase Mdm2
Synonyms:
Double minute 2 protein E3 ubiquitin-protein ligase Mdm2 (p53-binding protein Mdm2) Human Double Minute 2 (HDM2) MDM2-MDMX p53-Binding Protein MDM2 | p53-binding protein
Type:
Oncoprotein
Mol. Mass.:
55196.54
Organism:
Homo sapiens (Human)
Description:
Q00987
Residue:
491
  
Inhibitor
Name:
BDBM50392242
Synonyms:
CHEMBL2153473
Type:
Small organic molecule
Emp. Form.:
C73H105F3N18O18
Mol. Mass.:
1579.7198
SMILES:
CC(C)C[C@@H](NC(=O)[C@@H](CC(C)C)NC(=O)[C@@H](CCCCN)NC(=O)[C@@H](CCC(O)=O)NC(=O)[C@@H](Cc1ccc(cc1)C(F)(F)F)NC(=O)[C@@H](CC(N)=O)NC(=O)[C@@H](C)NC(=O)[C@@H](Cc1ccc(O)cc1)NC(=O)[C@@H](Cc1c[nH]c2ccccc12)NC(=O)[C@@H](C)NC(=O)[C@H](N)[C@@H](C)O)C(=O)N[C@H](CCCN=C(N)N)C(O)=O
: