Target
Alpha-1B adrenergic receptor
Ligand
BDBM50392647
Substrate
Meas. Tech.
ChEMBL_854041 (CHEMBL2155338)
Ki
446.68±n/a nM
Citation
 Fumagalli, LPallavicini, MBudriesi, RGobbi, MStraniero, VZagami, MChiodini, GBolchi, CChiarini, AMicucci, MValoti, E Affinity and activity profiling of unichiral 8-substituted 1,4-benzodioxane analogues of WB4101 reveals a potent and selectivea1B-adrenoceptor antagonist. Eur J Med Chem 58:184-91 (2012)  
Target
Name:
Alpha-1B adrenergic receptor
Synonyms:
ADA1B_HUMAN Adrenergic alpha1B Adrenergic receptor alpha Alpha 1B-adrenoreceptor | Alpha-1B adrenergic receptor
Type:
Enzyme
Mol. Mass.:
56862.13
Organism:
Homo sapiens (Human)
Description:
P35368
Residue:
520
  
Inhibitor
Name:
BDBM50392647
Synonyms:
CHEMBL2153559
Type:
Small organic molecule
Emp. Form.:
C20H25NO6
Mol. Mass.:
375.4156
SMILES:
COc1cccc(OC)c1OCCNC[C@H]1COc2c(OC)cccc2O1
: