Target
Cyclin-dependent kinase 7
Ligand
BDBM50393109
Substrate
Meas. Tech.
ChEMBL_853859 (CHEMBL2154885)
Kd
7500±n/a nM
Citation
 Shengule, SRLoa-Kum-Cheung, WLParish, CRBlairvacq, MMeijer, LNakao, YKaruso, P A one-pot synthesis and biological activity of ageladine A and analogues. J Med Chem 54:2492-503 (2011)  
Target
Name:
Cyclin-dependent kinase 7
Synonyms:
39 kDa protein kinase CAK1 CDK-activating kinase 1 (CAK) CDK7_HUMAN Cell division protein kinase 7 Cyclin-dependent kinase 7 (CDK7/cyclin H) P39 Mo15 TFIIH basal transcription factor complex kinase subunit
Type:
Enzyme Subunit
Mol. Mass.:
39047.01
Organism:
Homo sapiens (Human)
Description:
Residue:
346
  
Inhibitor
Name:
BDBM50393109
Synonyms:
CHEMBL2153264
Type:
Small organic molecule
Emp. Form.:
C11H9N5
Mol. Mass.:
211.2227
SMILES:
Nc1nc2c(nccc2[nH]1)-c1ccccn1
: