Target
Acyl-CoA desaturase 1
Ligand
BDBM50393166
Substrate
Meas. Tech.
ChEMBL_852941 (CHEMBL2154125)
IC50
7±n/a nM
Citation
 Oballa, RMBelair, LBlack, WCBleasby, KChan, CCDesroches, CDu, XGordon, RGuay, JGuiral, SHafey, MJHamelin, EHuang, ZKennedy, BLachance, NLandry, FLi, CSMancini, JNormandin, DPocai, APowell, DARamtohul, YKSkorey, KSørensen, DSturkenboom, WStyhler, AWaddleton, DMWang, HWong, SXu, LZhang, L Development of a liver-targeted stearoyl-CoA desaturase (SCD) inhibitor (MK-8245) to establish a therapeutic window for the treatment of diabetes and dyslipidemia. J Med Chem 54:5082-96 (2011)  
Target
Name:
Acyl-CoA desaturase 1
Synonyms:
ACOD1_RAT Scd Stearoyl-CoA desaturase 1 (SCD1)
Type:
Enzyme
Mol. Mass.:
41485.97
Organism:
Rattus norvegicus (Rat)
Description:
P07308
Residue:
358
  
Inhibitor
Name:
BDBM50393166
Synonyms:
CHEMBL2153601
Type:
Small organic molecule
Emp. Form.:
C16H15BrFN7O3S
Mol. Mass.:
484.303
SMILES:
OC(=O)Cn1nnc(n1)-c1nnc(s1)N1CCC(CC1)Oc1cc(F)ccc1Br
: