Target
Baculoviral IAP repeat-containing protein 3
Ligand
BDBM50273698
Substrate
Meas. Tech.
ChEMBL_855618 (CHEMBL2160289)
Ki
3±n/a nM
Citation
 Peng, YSun, HLu, JLiu, LCai, QShen, RYang, CYYi, HWang, S Bivalent Smac mimetics with a diazabicyclic core as highly potent antagonists of XIAP and cIAP1/2 and novel anticancer agents. J Med Chem 55:106-14 (2012)  
Target
Name:
Baculoviral IAP repeat-containing protein 3
Synonyms:
API2 BIRC3_HUMAN Baculoviral IAP repeat-containing protein 3 (IAP1 BIR3) MIHC XIAP-BIR3 | cIAP1/cIAP2
Type:
Protein
Mol. Mass.:
68365.75
Organism:
Homo sapiens (Human)
Description:
Q13489
Residue:
604
  
Inhibitor
Name:
BDBM50273698
Synonyms:
(5S,8S,10aR)-3-Acetyl-N-benzhydryl-5-((S)-2-(methylamino)-propanamido)-6-oxodeca-hydro pyrrolo[1,2-a][1,5]diazocine-8-carbox-amide | CHEMBL456400
Type:
Small organic molecule
Emp. Form.:
C29H37N5O4
Mol. Mass.:
519.6352
SMILES:
CN[C@@H](C)C(=O)N[C@H]1CN(CC[C@H]2CC[C@H](N2C1=O)C(=O)NC(c1ccccc1)c1ccccc1)C(C)=O
: