Target
Smoothened homolog
Ligand
BDBM50232973
Substrate
Meas. Tech.
ChEMBL_856169 (CHEMBL2162705)
Ki
12.7±n/a nM
Citation
 Wang, JMook, RALu, JGooden, DMRibeiro, AGuo, ABarak, LSLyerly, HKChen, W Identification of a novel Smoothened antagonist that potently suppresses Hedgehog signaling. Bioorg Med Chem 20:6751-7 (2012)  
Target
Name:
Smoothened homolog
Synonyms:
G-protein- coupled-like receptor Smoothened (Smo) SMOH Smoothened homolog
Type:
Protein
Mol. Mass.:
86415.51
Organism:
Homo sapiens (Human)
Description:
Q99835
Residue:
787
  
Inhibitor
Name:
BDBM50232973
Synonyms:
CHEMBL254129 | CYCLOPAMINE
Type:
Small organic molecule
Emp. Form.:
C27H41NO2
Mol. Mass.:
411.6199
SMILES:
C[C@@H]1[C@@H]2NC[C@@H](C)C[C@H]2O[C@]11CC[C@H]2[C@@H]3CC=C4C[C@@H](O)CC[C@]4(C)[C@H]3CC2=C1C
: